{"text_format":"1","workbook":"xlsx","n_sheets":15,"sheets":["記入例","支部No","初段","二段","三段","四段","五段","六段京都","六段愛知","七段京都","七段愛知","八段１日目","八段２日目","錬士","教士"],"not_rendered":{"charts":0,"images":0,"macros":1,"external_links":0,"defined_names":27,"comments":1,"pivot_tables":0},"unopened":[],"bounds":{"document_bytes":16777216,"sheet_cells":100000,"rows_first":2000,"rows_last":500,"rows_between":2000,"halvings":0,"cell_chars":16384,"cell_head_chars":4096},"cells_cut":0,"cells_raw":0,"read":"whole","date_system":"1900"}

{"sheet":"記入例","index":0,"n_rows":27,"n_cols":17,"rows_kept":27,"cut":false,"hidden":false,"merged":[[2,14,2,16],[3,14,3,16],[2,3,3,3],[2,4,3,4],[2,5,3,5],[2,6,2,7],[2,9,2,10],[3,6,3,8],[3,9,3,11]]}
[]
[null,null,null,null,null,"○段","受審申込み連名簿"]
[null,null,null,"申込人数",{"$f":"IF(D7=\"\",\"\",COUNTA(D7:D26))","v":2},"名","支部No.",null,{"$f":"IF(J3=\"\",\"\",VLOOKUP(J3,支部No!D:E,2,FALSE))","v":""},null,null,"支部",null,"審査日","年令基準"]
[null,null,null,null,null,null,"申込記載者氏名"]
[]
[null,"No.","全剣連番号","姓","名","姓(ﾌﾘｶﾞﾅ)","名(ﾌﾘｶﾞﾅ)","性別","学年\n/職業","生年月日","年令","△段取得\n年月日","経過\n年数","取得場所","写","形","学科"]
[null,1,1234567,"神奈川","太郎","ｶﾅｶﾞﾜ","ﾀﾛｳ","男","高１","1999-05-05",null,"2014-11-04"]
[null,2,1234569,"横浜","花子","ﾖｺﾊﾏ","ﾊﾅｺ","女","高２","1998-08-07",null,"2014-11-04"]
[null,3,null,null,null,null,null,null,null,null,{"$f":"IF(J9=\"\",\"\",DATEDIF(J9,$O$4,\"Y\"))","v":""},null,{"$f":"IF(L9=\"\",\"\",DATEDIF(DATE(YEAR(L9),MONTH(L9),1),DATE(YEAR($N$4),MONTH($N$4),DAY($N$4)),\"Y\"))","v":""}]
[null,4,null,null,null,null,null,null,null,null,"",null,""]
[null,5,null,null,null,null,null,null,null,null,"",null,""]
[null,6,null,null,null,null,null,null,null,null,"",null,""]
[null,7,null,null,null,null,null,null,null,null,"",null,""]
[null,8,null,null,null,null,null,null,null,null,"",null,""]
[null,9,null,null,null,null,null,null,null,null,"",null,""]
[null,10,null,null,null,null,null,null,null,null,"",null,""]
[null,11,null,null,null,null,null,null,null,null,"",null,""]
[null,12,null,null,null,null,null,null,null,null,"",null,""]
[null,13,null,null,null,null,null,null,null,null,"",null,""]
[null,14,null,null,null,null,null,null,null,null,"",null,""]
{"$rows_left_out":8}
{"sheet":"支部No","index":1,"n_rows":37,"n_cols":5,"rows_kept":37,"cut":false,"hidden":true,"merged":[]}
[null,null,null,"支部名","No."]
[null,null,null,"鶴見区",1]
[null,null,null,"神奈川区",2]
[null,null,null,"西区",3]
[null,null,null,"中区",4]
[null,null,null,"南区",5]
[null,null,null,"保土ケ谷区",6]
[null,null,null,"磯子区",7]
[null,null,null,"金沢区",8]
[null,null,null,"港北区",9]
[null,null,null,"戸塚区",10]
[null,null,null,"泉区",11]
[null,null,null,"栄区",12]
[null,null,null,"港南区",13]
[null,null,null,"旭区",14]
[null,null,null,"瀬谷区",15]
[null,null,null,"緑区",16]
[null,null,null,"青葉区",17]
[null,null,null,"都筑区",18]
[null,null,null,"川崎市",19]
{"$rows_left_out":18}
{"sheet":"初段","index":2,"n_rows":26,"n_cols":17,"rows_kept":26,"cut":false,"hidden":false,"merged":[[2,3,3,3],[2,4,3,4],[2,5,3,5],[2,14,2,16],[3,14,3,16],[2,6,2,7],[2,9,2,10],[3,6,3,8],[3,9,3,11]]}
[]
[null,null,null,null,null,"初段","受審申込み連名簿"]
[null,null,null,"申込人数",{"$f":"IF(D7=\"\",\"\",COUNTA(D7:D26))","v":""},"名","支部No.",null,{"$f":"IF(J3=\"\",\"\",VLOOKUP(J3,支部No!D:E,2,FALSE))","v":9},"港北区",null,"支部",null,"審査日","年令基準"]
[null,null,null,null,null,null,"申込記載者氏名",null,null,"(担当者名と団体名)",null,null,null,"2026-04-12",{"$f":"IF(N4=\"\",\"\",N4)","v":"2026-04-12"}]
[]
[null,"No.","全剣連番号","姓","名","姓(ﾌﾘｶﾞﾅ)","名(ﾌﾘｶﾞﾅ)","性別","学年\n/職業","生年月日","年令","一級取得\n年月日","経過\n年数","取得場所","写","形","学科"]
[null,1,null,null,null,null,null,null,null,null,{"$f":"IF(J7=\"\",\"\",DATEDIF(J7,$O$4,\"Y\"))","v":""},null,{"$f":"IF(L7=\"\",\"\",DATEDIF(DATE(YEAR(L7),MONTH(L7),1),DATE(YEAR($N$4),MONTH($N$4),DAY($N$4)),\"Y\"))","v":""}]
[null,2,null,null,null,null,null,null,null,null,"",null,""]
[null,3,null,null,null,null,null,null,null,null,"",null,""]
[null,4,null,null,null,null,null,null,null,null,"",null,""]
[null,5,null,null,null,null,null,null,null,null,"",null,""]
[null,6,null,null,null,null,null,null,null,null,"",null,""]
[null,7,null,null,null,null,null,null,null,null,"",null,""]
[null,8,null,null,null,null,null,null,null,null,"",null,""]
[null,9,null,null,null,null,null,null,null,null,"",null,""]
[null,10,null,null,null,null,null,null,null,null,"",null,""]
[null,11,null,null,null,null,null,null,null,null,"",null,""]
[null,12,null,null,null,null,null,null,null,null,"",null,""]
[null,13,null,null,null,null,null,null,null,null,"",null,""]
[null,14,null,null,null,null,null,null,null,null,"",null,""]
{"$rows_left_out":7}
{"sheet":"二段","index":3,"n_rows":26,"n_cols":17,"rows_kept":26,"cut":false,"hidden":false,"merged":[[2,14,2,16],[3,6,3,8],[3,9,3,11],[3,14,3,16],[2,3,3,3],[2,4,3,4],[2,5,3,5],[2,6,2,7],[2,9,2,10]]}
[]
[null,null,null,null,null,"二段","受審申込み連名簿"]
[null,null,null,"申込人数",{"$f":"IF(D7=\"\",\"\",COUNTA(D7:D26))","v":""},"名","支部No.",null,{"$f":"IF(J3=\"\",\"\",VLOOKUP(J3,支部No!D:E,2,FALSE))","v":9},"港北区",null,"支部",null,"審査日","年令基準"]
[null,null,null,null,null,null,"申込記載者氏名",null,null,"（担当者名と団体名）",null,null,null,"2026-04-12",{"$f":"IF(N4=\"\",\"\",N4)","v":"2026-04-12"}]
[]
[null,"No.","全剣連番号","姓","名","姓(ﾌﾘｶﾞﾅ)","名(ﾌﾘｶﾞﾅ)","性別","学年\n/職業","生年月日","年令","初段取得\n年月日","経過\n年数","取得場所","写","形","学科"]
[null,1,null,null,null,null,null,null,null,null,{"$f":"IF(J7=\"\",\"\",DATEDIF(J7,$O$4,\"Y\"))","v":""},null,{"$f":"IF(L7=\"\",\"\",DATEDIF(DATE(YEAR(L7),MONTH(L7),1),DATE(YEAR($N$4),MONTH($N$4),DAY($N$4)),\"Y\"))","v":""}]
[null,2,null,null,null,null,null,null,null,null,"",null,""]
[null,3,null,null,null,null,null,null,null,null,"",null,""]
[null,4,null,null,null,null,null,null,null,null,"",null,""]
[null,5,null,null,null,null,null,null,null,null,"",null,""]
[null,6,null,null,null,null,null,null,null,null,"",null,""]
[null,7,null,null,null,null,null,null,null,null,"",null,""]
[null,8,null,null,null,null,null,null,null,null,"",null,""]
[null,9,null,null,null,null,null,null,null,null,"",null,""]
[null,10,null,null,null,null,null,null,null,null,"",null,""]
[null,11,null,null,null,null,null,null,null,null,"",null,""]
[null,12,null,null,null,null,null,null,null,null,"",null,""]
[null,13,null,null,null,null,null,null,null,null,"",null,""]
[null,14,null,null,null,null,null,null,null,null,"",null,""]
{"$rows_left_out":7}
{"sheet":"三段","index":4,"n_rows":26,"n_cols":17,"rows_kept":26,"cut":false,"hidden":false,"merged":[[2,14,2,16],[3,6,3,8],[3,9,3,11],[3,14,3,16],[2,3,3,3],[2,4,3,4],[2,5,3,5],[2,6,2,7],[2,9,2,10]]}
[]
[null,null,null,null,null,"三段","受審申込み連名簿"]
[null,null,null,"申込人数",{"$f":"IF(D7=\"\",\"\",COUNTA(D7:D26))","v":""},"名","支部No.",null,{"$f":"IF(J3=\"\",\"\",VLOOKUP(J3,支部No!D:E,2,FALSE))","v":9},"港北区",null,"支部",null,"審査日","年令基準"]
[null,null,null,null,null,null,"申込記載者氏名",null,null,"(担当者名と団体名)",null,null,null,"2026-04-12",{"$f":"IF(N4=\"\",\"\",N4)","v":"2026-04-12"}]
[]
[null,"No.","全剣連番号","姓","名","姓(ﾌﾘｶﾞﾅ)","名(ﾌﾘｶﾞﾅ)","性別","学年\n/職業","生年月日","年令","二段取得\n年月日","経過\n年数","取得場所","写","形","学科"]
[null,1,null,null,null,null,null,null,null,null,{"$f":"IF(J7=\"\",\"\",DATEDIF(J7,$O$4,\"Y\"))","v":""},null,{"$f":"IF(L7=\"\",\"\",DATEDIF(DATE(YEAR(L7),MONTH(L7),1),DATE(YEAR($N$4),MONTH($N$4),DAY($N$4)),\"Y\"))","v":""}]
[null,2,null,null,null,null,null,null,null,null,"",null,""]
[null,3,null,null,null,null,null,null,null,null,"",null,""]
[null,4,null,null,null,null,null,null,null,null,"",null,""]
[null,5,null,null,null,null,null,null,null,null,"",null,""]
[null,6,null,null,null,null,null,null,null,null,"",null,""]
[null,7,null,null,null,null,null,null,null,null,"",null,""]
[null,8,null,null,null,null,null,null,null,null,"",null,""]
[null,9,null,null,null,null,null,null,null,null,"",null,""]
[null,10,null,null,null,null,null,null,null,null,"",null,""]
[null,11,null,null,null,null,null,null,null,null,"",null,""]
[null,12,null,null,null,null,null,null,null,null,"",null,""]
[null,13,null,null,null,null,null,null,null,null,"",null,""]
[null,14,null,null,null,null,null,null,null,null,"",null,""]
{"$rows_left_out":7}
{"sheet":"四段","index":5,"n_rows":26,"n_cols":17,"rows_kept":26,"cut":false,"hidden":false,"merged":[[2,14,2,16],[3,6,3,8],[3,9,3,11],[3,14,3,16],[2,3,3,3],[2,4,3,4],[2,5,3,5],[2,6,2,7],[2,9,2,10]]}
[]
[null,null,null,null,null,"四段","受審申込み連名簿"]
[null,null,null,"申込人数",{"$f":"IF(D7=\"\",\"\",COUNTA(D7:D26))","v":""},"名","支部No.",null,{"$f":"IF(J3=\"\",\"\",VLOOKUP(J3,支部No!D:E,2,FALSE))","v":9},"港北区",null,"支部",null,"審査日","年令基準"]
[null,null,null,null,null,null,"申込記載者氏名",null,null,"（担当者名と団体名）",null,null,null,"2026-05-24",{"$f":"IF(N4=\"\",\"\",N4)","v":"2026-05-24"}]
[]
[null,"No.","全剣連番号","姓","名","姓(ﾌﾘｶﾞﾅ)","名(ﾌﾘｶﾞﾅ)","性別","学年\n/職業","生年月日","年令","三段取得\n年月日","経過\n年数","取得場所","写","形","学科"]
[null,1,null,null,null,null,null,null,null,null,{"$f":"IF(J7=\"\",\"\",DATEDIF(J7,$O$4,\"Y\"))","v":""},null,{"$f":"IF(L7=\"\",\"\",DATEDIF(DATE(YEAR(L7),MONTH(L7),1),DATE(YEAR($N$4),MONTH($N$4),DAY($N$4)),\"Y\"))","v":""}]
[null,2,null,null,null,null,null,null,null,null,"",null,""]
[null,3,null,null,null,null,null,null,null,null,"",null,""]
[null,4,null,null,null,null,null,null,null,null,"",null,""]
[null,5,null,null,null,null,null,null,null,null,"",null,""]
[null,6,null,null,null,null,null,null,null,null,"",null,""]
[null,7,null,null,null,null,null,null,null,null,"",null,""]
[null,8,null,null,null,null,null,null,null,null,"",null,""]
[null,9,null,null,null,null,null,null,null,null,"",null,""]
[null,10,null,null,null,null,null,null,null,null,"",null,""]
[null,11,null,null,null,null,null,null,null,null,"",null,""]
[null,12,null,null,null,null,null,null,null,null,"",null,""]
[null,13,null,null,null,null,null,null,null,null,"",null,""]
[null,14,null,null,null,null,null,null,null,null,"",null,""]
{"$rows_left_out":7}
{"sheet":"五段","index":6,"n_rows":26,"n_cols":17,"rows_kept":26,"cut":false,"hidden":false,"merged":[[2,14,2,16],[3,6,3,8],[3,9,3,11],[3,14,3,16],[2,3,3,3],[2,4,3,4],[2,5,3,5],[2,6,2,7],[2,9,2,10]]}
[]
[null,null,null,null,null,"五段","受審申込み連名簿"]
[null,null,null,"申込人数",{"$f":"IF(D7=\"\",\"\",COUNTA(D7:D26))","v":""},"名","支部No.",null,{"$f":"IF(J3=\"\",\"\",VLOOKUP(J3,支部No!D:E,2,FALSE))","v":9},"港北区",null,"支部",null,"審査日","年令基準"]
[null,null,null,null,null,null,"申込記載者氏名",null,null,"（担当者名と団体名）",null,null,null,"2026-05-24",{"$f":"IF(N4=\"\",\"\",N4)","v":"2026-05-24"}]
[]
[null,"No.","全剣連番号","姓","名","姓(ﾌﾘｶﾞﾅ)","名(ﾌﾘｶﾞﾅ)","性別","学年\n/職業","生年月日","年令","四段取得\n年月日","経過\n年数","取得場所","写","形","学科"]
[null,1,null,null,null,null,null,null,null,null,{"$f":"IF(J7=\"\",\"\",DATEDIF(J7,$O$4,\"Y\"))","v":""},null,{"$f":"IF(L7=\"\",\"\",DATEDIF(DATE(YEAR(L7),MONTH(L7),1),DATE(YEAR($N$4),MONTH($N$4),DAY($N$4)),\"Y\"))","v":""}]
[null,2,null,null,null,null,null,null,null,null,"",null,""]
[null,3,null,null,null,null,null,null,null,null,"",null,""]
[null,4,null,null,null,null,null,null,null,null,"",null,""]
[null,5,null,null,null,null,null,null,null,null,"",null,""]
[null,6,null,null,null,null,null,null,null,null,"",null,""]
[null,7,null,null,null,null,null,null,null,null,"",null,""]
[null,8,null,null,null,null,null,null,null,null,"",null,""]
[null,9,null,null,null,null,null,null,null,null,"",null,""]
[null,10,null,null,null,null,null,null,null,null,"",null,""]
[null,11,null,null,null,null,null,null,null,null,"",null,""]
[null,12,null,null,null,null,null,null,null,null,"",null,""]
[null,13,null,null,null,null,null,null,null,null,"",null,""]
[null,14,null,null,null,null,null,null,null,null,"",null,""]
{"$rows_left_out":7}
{"sheet":"六段京都","index":7,"n_rows":26,"n_cols":17,"rows_kept":26,"cut":false,"hidden":false,"merged":[[2,14,2,16],[3,6,3,8],[3,9,3,11],[3,14,3,16],[2,3,3,3],[2,4,3,4],[2,5,3,5],[2,6,2,7],[2,9,2,10]]}
[]
[null,null,null,null,null,"六段","受審申込み連名簿"]
[null,null,"受審地","申込人数",{"$f":"IF(D7=\"\",\"\",COUNTA(D7:D26))","v":""},"名","支部No.",null,{"$f":"IF(J3=\"\",\"\",VLOOKUP(J3,支部No!D:E,2,FALSE))","v":9},"港北区",null,"支部",null,"審査日","年令基準"]
[null,null,"京都",null,null,null,"申込記載者氏名",null,null,"（担当者名と団体名）",null,null,null,"2026-04-29",{"$f":"IF(N4=\"\",\"\",N4)","v":"2026-04-29"}]
[]
[null,"No.","全剣連番号","姓","名","姓(ﾌﾘｶﾞﾅ)","名(ﾌﾘｶﾞﾅ)","性別","学年\n/職業","生年月日","年令","五段取得\n年月日","経過\n年数","取得場所","写","形","学科"]
[null,1,null,null,null,null,null,null,null,null,{"$f":"IF(J7=\"\",\"\",DATEDIF(J7,$O$4,\"Y\"))","v":""},null,{"$f":"IF(L7=\"\",\"\",DATEDIF(DATE(YEAR(L7),MONTH(L7),1),DATE(YEAR($N$4),MONTH($N$4),DAY($N$4)),\"Y\"))","v":""}]
[null,2,null,null,null,null,null,null,null,null,"",null,""]
[null,3,null,null,null,null,null,null,null,null,"",null,""]
[null,4,null,null,null,null,null,null,null,null,"",null,""]
[null,5,null,null,null,null,null,null,null,null,"",null,""]
[null,6,null,null,null,null,null,null,null,null,"",null,""]
[null,7,null,null,null,null,null,null,null,null,"",null,""]
[null,8,null,null,null,null,null,null,null,null,"",null,""]
[null,9,null,null,null,null,null,null,null,null,"",null,""]
[null,10,null,null,null,null,null,null,null,null,"",null,""]
[null,11,null,null,null,null,null,null,null,null,"",null,""]
[null,12,null,null,null,null,null,null,null,null,"",null,""]
[null,13,null,null,null,null,null,null,null,null,"",null,""]
[null,14,null,null,null,null,null,null,null,null,"",null,""]
{"$rows_left_out":7}
{"sheet":"六段愛知","index":8,"n_rows":26,"n_cols":17,"rows_kept":26,"cut":false,"hidden":false,"merged":[[2,14,2,16],[3,6,3,8],[3,9,3,11],[3,14,3,16],[2,3,3,3],[2,4,3,4],[2,5,3,5],[2,6,2,7],[2,9,2,10]]}
[]
[null,null,null,null,null,"六段","受審申込み連名簿"]
[null,null,"受審地","申込人数",{"$f":"IF(D7=\"\",\"\",COUNTA(D7:D26))","v":""},"名","支部No.",null,{"$f":"IF(J3=\"\",\"\",VLOOKUP(J3,支部No!D:E,2,FALSE))","v":9},"港北区",null,"支部",null,"審査日","年令基準"]
[null,null,"愛知",null,null,null,"申込記載者氏名",null,null,"（担当者名と団体名）",null,null,null,"2026-05-10",{"$f":"IF(N4=\"\",\"\",N4)","v":"2026-05-10"}]
[]
[null,"No.","全剣連番号","姓","名","姓(ﾌﾘｶﾞﾅ)","名(ﾌﾘｶﾞﾅ)","性別","学年\n/職業","生年月日","年令","五段取得\n年月日","経過\n年数","取得場所","写","形","学科"]
[null,1,null,null,null,null,null,null,null,null,{"$f":"IF(J7=\"\",\"\",DATEDIF(J7,$O$4,\"Y\"))","v":""},null,{"$f":"IF(L7=\"\",\"\",DATEDIF(DATE(YEAR(L7),MONTH(L7),1),DATE(YEAR($N$4),MONTH($N$4),DAY($N$4)),\"Y\"))","v":""}]
[null,2,null,null,null,null,null,null,null,null,"",null,""]
[null,3,null,null,null,null,null,null,null,null,"",null,""]
[null,4,null,null,null,null,null,null,null,null,"",null,""]
[null,5,null,null,null,null,null,null,null,null,"",null,""]
[null,6,null,null,null,null,null,null,null,null,"",null,""]
[null,7,null,null,null,null,null,null,null,null,"",null,""]
[null,8,null,null,null,null,null,null,null,null,"",null,""]
[null,9,null,null,null,null,null,null,null,null,"",null,""]
[null,10,null,null,null,null,null,null,null,null,"",null,""]
[null,11,null,null,null,null,null,null,null,null,"",null,""]
[null,12,null,null,null,null,null,null,null,null,"",null,""]
[null,13,null,null,null,null,null,null,null,null,"",null,""]
[null,14,null,null,null,null,null,null,null,null,"",null,""]
{"$rows_left_out":7}
{"sheet":"七段京都","index":9,"n_rows":26,"n_cols":17,"rows_kept":26,"cut":false,"hidden":false,"merged":[[2,14,2,16],[3,6,3,8],[3,9,3,11],[3,14,3,16],[2,3,3,3],[2,4,3,4],[2,5,3,5],[2,6,2,7],[2,9,2,10]]}
[]
[null,null,null,null,null,"七段","受審申込み連名簿"]
[null,null,"受審地","申込人数",{"$f":"IF(D7=\"\",\"\",COUNTA(D7:D26))","v":""},"名","支部No.",null,{"$f":"IF(J3=\"\",\"\",VLOOKUP(J3,支部No!D:E,2,FALSE))","v":9},"港北区",null,"支部",null,"審査日","年令基準"]
[null,null,"京都",null,null,null,"申込記載者氏名",null,null,"（担当者名と団体名）",null,null,null,"2026-04-30",{"$f":"IF(N4=\"\",\"\",N4)","v":"2026-04-30"}]
[]
[null,"No.","全剣連番号","姓","名","姓(ﾌﾘｶﾞﾅ)","名(ﾌﾘｶﾞﾅ)","性別","学年\n/職業","生年月日","年令","六段取得\n年月日","経過\n年数","取得場所","写","形","学科"]
[null,1,null,null,null,null,null,null,null,null,{"$f":"IF(J7=\"\",\"\",DATEDIF(J7,$O$4,\"Y\"))","v":""},null,{"$f":"IF(L7=\"\",\"\",DATEDIF(DATE(YEAR(L7),MONTH(L7),1),DATE(YEAR($N$4),MONTH($N$4),DAY($N$4)),\"Y\"))","v":""}]
[null,2,null,null,null,null,null,null,null,null,"",null,""]
[null,3,null,null,null,null,null,null,null,null,"",null,""]
[null,4,null,null,null,null,null,null,null,null,"",null,""]
[null,5,null,null,null,null,null,null,null,null,"",null,""]
[null,6,null,null,null,null,null,null,null,null,"",null,""]
[null,7,null,null,null,null,null,null,null,null,"",null,""]
[null,8,null,null,null,null,null,null,null,null,"",null,""]
[null,9,null,null,null,null,null,null,null,null,"",null,""]
[null,10,null,null,null,null,null,null,null,null,"",null,""]
[null,11,null,null,null,null,null,null,null,null,"",null,""]
[null,12,null,null,null,null,null,null,null,null,"",null,""]
[null,13,null,null,null,null,null,null,null,null,"",null,""]
[null,14,null,null,null,null,null,null,null,null,"",null,""]
{"$rows_left_out":7}
{"sheet":"七段愛知","index":10,"n_rows":26,"n_cols":17,"rows_kept":26,"cut":false,"hidden":false,"merged":[[2,14,2,16],[3,6,3,8],[3,9,3,11],[3,14,3,16],[2,3,3,3],[2,4,3,4],[2,5,3,5],[2,6,2,7],[2,9,2,10]]}
[]
[null,null,null,null,null,"七段","受審申込み連名簿"]
[null,null,"受審地","申込人数",{"$f":"IF(D7=\"\",\"\",COUNTA(D7:D26))","v":""},"名","支部No.",null,{"$f":"IF(J3=\"\",\"\",VLOOKUP(J3,支部No!D:E,2,FALSE))","v":9},"港北区",null,"支部",null,"審査日","年令基準"]
[null,null,"愛知",null,null,null,"申込記載者氏名",null,null,"（担当者名と団体名）",null,null,null,"2026-05-09",{"$f":"IF(N4=\"\",\"\",N4)","v":"2026-05-09"}]
[]
[null,"No.","全剣連番号","姓","名","姓(ﾌﾘｶﾞﾅ)","名(ﾌﾘｶﾞﾅ)","性別","学年\n/職業","生年月日","年令","六段取得\n年月日","経過\n年数","取得場所","写","形","学科"]
[null,1,null,null,null,null,null,null,null,null,{"$f":"IF(J7=\"\",\"\",DATEDIF(J7,$O$4,\"Y\"))","v":""},null,{"$f":"IF(L7=\"\",\"\",DATEDIF(DATE(YEAR(L7),MONTH(L7),1),DATE(YEAR($N$4),MONTH($N$4),DAY($N$4)),\"Y\"))","v":""}]
[null,2,null,null,null,null,null,null,null,null,"",null,""]
[null,3,null,null,null,null,null,null,null,null,"",null,""]
[null,4,null,null,null,null,null,null,null,null,"",null,""]
[null,5,null,null,null,null,null,null,null,null,"",null,""]
[null,6,null,null,null,null,null,null,null,null,"",null,""]
[null,7,null,null,null,null,null,null,null,null,"",null,""]
[null,8,null,null,null,null,null,null,null,null,"",null,""]
[null,9,null,null,null,null,null,null,null,null,"",null,""]
[null,10,null,null,null,null,null,null,null,null,"",null,""]
[null,11,null,null,null,null,null,null,null,null,"",null,""]
[null,12,null,null,null,null,null,null,null,null,"",null,""]
[null,13,null,null,null,null,null,null,null,null,"",null,""]
[null,14,null,null,null,null,null,null,null,null,"",null,""]
{"$rows_left_out":7}
{"sheet":"八段１日目","index":11,"n_rows":26,"n_cols":17,"rows_kept":26,"cut":false,"hidden":false,"merged":[[2,14,2,16],[3,6,3,8],[3,9,3,11],[3,14,3,16],[2,3,3,3],[2,4,3,4],[2,5,3,5],[2,6,2,7],[2,9,2,10]]}
[]
[null,null,"↓いずれかを○",null,null,"八段","受審申込み連名簿"]
[null,null,"１日目","申込人数",{"$f":"IF(D7=\"\",\"\",COUNTA(D7:D26))","v":""},"名","支部No.",null,{"$f":"IF(J3=\"\",\"\",VLOOKUP(J3,支部No!D:E,2,FALSE))","v":9},"港北区",null,"支部",null,"審査日","年令基準"]
[null,null,null,null,null,null,"申込記載者氏名",null,null,"（担当者名と団体名）",null,null,null,"2026-05-01",{"$f":"IF(N4=\"\",\"\",N4)","v":"2026-05-01"}]
[]
[null,"No.","全剣連番号","姓","名","姓(ﾌﾘｶﾞﾅ)","名(ﾌﾘｶﾞﾅ)","性別","学年\n/職業","生年月日","年令","七段取得\n年月日","経過\n年数","取得場所","写","形","学科"]
[null,1,null,null,null,null,null,null,null,null,{"$f":"IF(J7=\"\",\"\",DATEDIF(J7,$O$4,\"Y\"))","v":""},null,{"$f":"IF(L7=\"\",\"\",DATEDIF(DATE(YEAR(L7),MONTH(L7),1),DATE(YEAR($N$4),MONTH($N$4),DAY($N$4)),\"Y\"))","v":""}]
[null,2,null,null,null,null,null,null,null,null,"",null,""]
[null,3,null,null,null,null,null,null,null,null,"",null,""]
[null,4,null,null,null,null,null,null,null,null,"",null,""]
[null,5,null,null,null,null,null,null,null,null,"",null,""]
[null,6,null,null,null,null,null,null,null,null,"",null,""]
[null,7,null,null,null,null,null,null,null,null,"",null,""]
[null,8,null,null,null,null,null,null,null,null,"",null,""]
[null,9,null,null,null,null,null,null,null,null,"",null,""]
[null,10,null,null,null,null,null,null,null,null,"",null,""]
[null,11,null,null,null,null,null,null,null,null,"",null,""]
[null,12,null,null,null,null,null,null,null,null,"",null,""]
[null,13,null,null,null,null,null,null,null,null,"",null,""]
[null,14,null,null,null,null,null,null,null,null,"",null,""]
{"$rows_left_out":7}
{"sheet":"八段２日目","index":12,"n_rows":26,"n_cols":17,"rows_kept":26,"cut":false,"hidden":false,"merged":[[2,14,2,16],[3,6,3,8],[3,9,3,11],[3,14,3,16],[2,3,3,3],[2,4,3,4],[2,5,3,5],[2,6,2,7],[2,9,2,10]]}
[]
[null,null,"↓いずれかを○",null,null,"八段","受審申込み連名簿"]
[null,null,null,"申込人数",{"$f":"IF(D7=\"\",\"\",COUNTA(D7:D26))","v":""},"名","支部No.",null,{"$f":"IF(J3=\"\",\"\",VLOOKUP(J3,支部No!D:E,2,FALSE))","v":9},"港北区",null,"支部",null,"審査日","年令基準"]
[null,null,"２日目",null,null,null,"申込記載者氏名",null,null,"（担当者名と団体名）",null,null,null,"2026-05-02",{"$f":"IF(N4=\"\",\"\",N4)","v":"2026-05-02"}]
[]
[null,"No.","全剣連番号","姓","名","姓(ﾌﾘｶﾞﾅ)","名(ﾌﾘｶﾞﾅ)","性別","学年\n/職業","生年月日","年令","七段取得\n年月日","経過\n年数","取得場所","写","形","学科"]
[null,1,null,null,null,null,null,null,null,null,{"$f":"IF(J7=\"\",\"\",DATEDIF(J7,$O$4,\"Y\"))","v":""},null,{"$f":"IF(L7=\"\",\"\",DATEDIF(DATE(YEAR(L7),MONTH(L7),1),DATE(YEAR($N$4),MONTH($N$4),DAY($N$4)),\"Y\"))","v":""}]
[null,2,null,null,null,null,null,null,null,null,"",null,""]
[null,3,null,null,null,null,null,null,null,null,"",null,""]
[null,4,null,null,null,null,null,null,null,null,"",null,""]
[null,5,null,null,null,null,null,null,null,null,"",null,""]
[null,6,null,null,null,null,null,null,null,null,"",null,""]
[null,7,null,null,null,null,null,null,null,null,"",null,""]
[null,8,null,null,null,null,null,null,null,null,"",null,""]
[null,9,null,null,null,null,null,null,null,null,"",null,""]
[null,10,null,null,null,null,null,null,null,null,"",null,""]
[null,11,null,null,null,null,null,null,null,null,"",null,""]
[null,12,null,null,null,null,null,null,null,null,"",null,""]
[null,13,null,null,null,null,null,null,null,null,"",null,""]
[null,14,null,null,null,null,null,null,null,null,"",null,""]
{"$rows_left_out":7}
{"sheet":"錬士","index":13,"n_rows":26,"n_cols":18,"rows_kept":26,"cut":false,"hidden":false,"merged":[[2,14,2,17],[3,14,3,17],[2,3,3,3],[2,4,3,4],[2,5,3,5],[2,6,2,7],[2,9,2,10],[3,6,3,8],[3,9,3,11]]}
[]
[null,null,null,null,null,"錬士","受審申込み連名簿"]
[null,null,null,"申込人数",{"$f":"IF(D7=\"\",\"\",COUNTA(D7:D26))","v":""},"名","支部No.",null,{"$f":"IF(J3=\"\",\"\",VLOOKUP(J3,支部No!D:E,2,FALSE))","v":9},"港北区",null,"支部",null,"審査日","年令基準"]
[null,null,null,null,null,null,"申込記載者氏名",null,null,"（担当者名と団体名）",null,null,"印","2026-05-06",{"$f":"IF(N4=\"\",\"\",N4)","v":"2026-05-06"}]
[]
[null,"No.","全剣連番号","姓","名","姓(ﾌﾘｶﾞﾅ)","名(ﾌﾘｶﾞﾅ)","性別","学年\n/職業","生年月日","年令","現段取得\n年月日","経過\n年数","取得場所","写","形","学科","段位"]
[null,1,null,null,null,null,null,null,null,null,{"$f":"IF(J7=\"\",\"\",DATEDIF(J7,$O$4,\"Y\"))","v":""},null,{"$f":"IF(L7=\"\",\"\",DATEDIF(DATE(YEAR(L7),MONTH(L7),1),DATE(YEAR($N$4),MONTH($N$4),DAY($N$4)),\"Y\"))","v":""}]
[null,2,null,null,null,null,null,null,null,null,"",null,""]
[null,3,null,null,null,null,null,null,null,null,"",null,""]
[null,4,null,null,null,null,null,null,null,null,"",null,""]
[null,5,null,null,null,null,null,null,null,null,"",null,""]
[null,6,null,null,null,null,null,null,null,null,"",null,""]
[null,7,null,null,null,null,null,null,null,null,"",null,""]
[null,8,null,null,null,null,null,null,null,null,"",null,""]
[null,9,null,null,null,null,null,null,null,null,"",null,""]
[null,10,null,null,null,null,null,null,null,null,"",null,""]
[null,11,null,null,null,null,null,null,null,null,"",null,""]
[null,12,null,null,null,null,null,null,null,null,"",null,""]
[null,13,null,null,null,null,null,null,null,null,"",null,""]
[null,14,null,null,null,null,null,null,null,null,"",null,""]
{"$rows_left_out":7}
{"sheet":"教士","index":14,"n_rows":26,"n_cols":18,"rows_kept":26,"cut":false,"hidden":false,"merged":[[2,14,2,17],[3,6,3,8],[3,9,3,11],[3,14,3,17],[2,3,3,3],[2,4,3,4],[2,5,3,5],[2,6,2,7],[2,9,2,10]]}
[]
[null,null,null,null,null,"教士","受審申込み連名簿"]
[null,null,null,"申込人数",{"$f":"IF(D7=\"\",\"\",COUNTA(D7:D26))","v":""},"名","支部No.",null,{"$f":"IF(J3=\"\",\"\",VLOOKUP(J3,支部No!D:E,2,FALSE))","v":9},"港北区",null,"支部",null,"審査日","年令基準"]
[null,null,null,null,null,null,"申込記載者氏名",null,null,"（担当者名と団体名）",null,null,null,"2026-05-06",{"$f":"IF(N4=\"\",\"\",N4)","v":"2026-05-06"}]
[]
[null,"No.","全剣連番号","姓","名","姓(ﾌﾘｶﾞﾅ)","名(ﾌﾘｶﾞﾅ)","性別","学年\n/職業","生年月日","年令","現段取得\n年月日","経過\n年数","取得場所","写","形","学科","段位"]
[null,1,null,null,null,null,null,null,null,null,{"$f":"IF(J7=\"\",\"\",DATEDIF(J7,$O$4,\"Y\"))","v":""},null,{"$f":"IF(L7=\"\",\"\",DATEDIF(DATE(YEAR(L7),MONTH(L7),1),DATE(YEAR($N$4),MONTH($N$4),DAY($N$4)),\"Y\"))","v":""}]
[null,2,null,null,null,null,null,null,null,null,"",null,""]
[null,3,null,null,null,null,null,null,null,null,"",null,""]
[null,4,null,null,null,null,null,null,null,null,"",null,""]
[null,5,null,null,null,null,null,null,null,null,"",null,""]
[null,6,null,null,null,null,null,null,null,null,"",null,""]
[null,7,null,null,null,null,null,null,null,null,"",null,""]
[null,8,null,null,null,null,null,null,null,null,"",null,""]
[null,9,null,null,null,null,null,null,null,null,"",null,""]
[null,10,null,null,null,null,null,null,null,null,"",null,""]
[null,11,null,null,null,null,null,null,null,null,"",null,""]
[null,12,null,null,null,null,null,null,null,null,"",null,""]
[null,13,null,null,null,null,null,null,null,null,"",null,""]
[null,14,null,null,null,null,null,null,null,null,"",null,""]
{"$rows_left_out":6}